rigole
created: 2011-09-01T00:00:00+02:00
modified: 2014-12-02T12:44:16+01:00
status: 1
type: Concept
broader: T96-1076
definition: Petit conduit maçonné, parfois souterrain, ou petit fossé aménagé pour amener l'eau dans un bief, un réservoir, etc. ou au contraire pour en évacuer le trop-plein.
in scheme: T96