siphon
created: 2011-09-01T00:00:00+02:00
modified: 2014-10-16T15:20:46+02:00
status: 1
type: Concept
broader: T96-1076
definition: Conduite maçonnée, généralement chemisée, destinée à faire circuler de l’eau à des niveaux différents ; le dispositif est notamment composé de deux coudes permettant au liquide de s’écouler d’un niveau donné à un niveau sensiblement égal en passant par un niveau inférieur.
in scheme: T96