vanne
created: 2011-09-01T00:00:00+02:00
modified: 2014-10-16T15:22:40+02:00
status: 1
type: Concept
broader: T96-1076
definition: Ouvrage de régulation des eaux, permettant à volonté la mise en communication de deux plans d’eau ou leur isolement l’un de l’autre. L’ouvrage se compose le plus souvent d’une porte mobile placée verticalement entre deux coulisses.
in scheme: T96
preferred label: sluice gates @en-us
scope note: Ne pas confondre avec porte de garde, ni avec porte d'écluse, qui assure le passage à la navigation.