passage à niveau
created: 2011-09-01T00:00:00+02:00
modified: 2014-12-02T13:03:57+01:00
status: 1
type: Concept
broader: T96-1045
definition: Aménagement au croisement d'une voie ferrée et d'une route de même niveau. Il est souvent associé à une signalisation, à des barrières mobiles et à une maison de garde-barrières.
in scheme: T96
preferred label: grade crossings @en-us