piste d'aviation
created: 2011-09-01T00:00:00+02:00
modified: 2014-10-16T15:26:27+02:00
status: 1
type: Concept
broader: T96-1045
definition: Bande de terrain pouvant comporter des fondations importantes et un revêtement en bitume ou en béton, sur laquelle roulent les avions pendant le décollage ou l'atterrissage.
in scheme: T96
preferred label: runways @en-us
scope note: Ne pas confondre avec aérodrome.