station de villégiature
terme associe: T96-14
created: 2011-09-01T00:00:00+02:00
modified: 2015-01-07T11:38:22+01:00
status: 1
type: Concept
broader: T96-5
definition: Agglomération ou partie d’agglomération dont l’origine ou la fonction emblématique est le repos, la détente, les loisirs, le sport, la culture, la visite de curiosités naturelles. Il s’y trouve plus d’habitants temporaires que permanents.
in scheme: T96
narrower: T96-12
narrower: T96-13
preferred label: resorts @en-us
related: T96-14