quai
terme associe: T96-1032
terme associe: T96-1056
created: 2011-09-01T00:00:00+02:00
modified: 2014-12-02T14:44:08+01:00
status: 1
type: Concept
broader: T96-1045
definition: Aménagement formé d'un terre-plein supérieur et d'un mur vertical ou taluté. Dans les gares de chemin de fer, de transbordement, etc., plate-forme située le long des voies permettant l'embarquement des voyageurs et le chargement des marchandises ; dans les édifices industriels ou commerciaux, plate-forme permettant le transbordement à niveau des marchandises.
in scheme: T96
narrower: T96-1106
preferred label: quays @en-us
related: T96-1032
related: T96-1056