embarcadère
terme associe: T96-1046
created: 2011-09-01T00:00:00+02:00
modified: 2014-12-02T14:50:02+01:00
status: 1
type: Concept
alternative label: débarcadère
broad match: http://data.bnf.fr/ark:/12148/cb119494913
broader: T96-1105
definition: Ouvrage aménagé dans un port ou sur une rivière, pour permettre l'embarquement et le débarquement de voyageurs et de marchandises. Il peut comprendre un autre type d’édifices.
in scheme: T96
preferred label: landings (marine structures) @en-us
related: T96-1046