relais de télécommunication
terme associe: T96-466
created: 2011-09-01T00:00:00+02:00
modified: 2014-10-16T15:34:30+02:00
status: 1
type: Concept
broader: T96-1045
definition: Ouvrage abritant ou supportant les équipements permettant d'assurer les fonctions d'émission et de réception d'ondes électromagnétiques pour la radiodiffusion (radio et télévision) ou les télécommunications (téléphonie, internet, etc.).
in scheme: T96
preferred label: broadcasting stations @en-us
related: T96-466
scope note: Les équipements (émetteur, récepteur et leurs générateurs) font l’objet d’un dossier objet mobilier.