funiculaire
created: 2011-09-01T00:00:00+02:00
modified: 2014-12-02T14:53:57+01:00
status: 1
type: Concept
broader: T96-1108
definition: Remontée mécanique équipée de véhicules circulant sur des rails en pente et dont la traction est assurée par un câble pour s'affranchir de la déclivité du terrain. Il est généralement utilisé comme transport en commun.
in scheme: T96
preferred label: funicular railways @en-us
scope note: Ne pas confondre avec chemin de fer à crémaillère.