téléphérique
created: 2011-09-01T00:00:00+02:00
modified: 2014-12-02T15:00:04+01:00
status: 1
type: Concept
alternative label: téléférique
broader: T96-1108
definition: Infrastructure comportant plusieurs câbles (porteur ou tracteur) pour le transport de voyageurs dans une cabine suspendue. Ces câbles sont tendus entre deux gares et peuvent être soutenus en ligne par des pylônes.
in scheme: T96