jardin
created: 2011-09-01T00:00:00+02:00
modified: 2014-12-31T11:21:27+01:00
status: 1
type: Concept
broader: T96-1115
definition: Espace organisé, public ou privé, comportant des végétaux en pleine terre ou hors sol.
in scheme: T96
narrower: T96-1117
narrower: T96-1122
narrower: T96-1124
narrower: T96-1132
narrower: T96-1133
narrower: T96-1134
narrower: T96-1138