jardin d'attractions
terme associe: T96-343
created: 2011-09-01T00:00:00+02:00
modified: 2014-09-18T16:04:26+02:00
status: 1
type: Concept
broader: T96-1117
definition: Jardin ou parc d'agrément public ou privé comportant des fabriques, fontaines et jeux destinés au divertissement des visiteurs.
in scheme: T96
related: T96-343