jardin botanique
created: 2011-09-01T00:00:00+02:00
modified: 2014-12-31T10:26:47+01:00
status: 1
type: Concept
alternative label: arboretum
alternative label: jardin de collection
broader: T96-1116
definition: Jardin destiné à l'étude et à la collection des végétaux. L'arboretum est un parc botanique spécialisé dans l'étude des végétaux ligneux.
in scheme: T96
narrower: T96-1123
preferred label: botanical gardens @en-us