jardin potager
created: 2011-09-01T00:00:00+02:00
modified: 2014-12-31T10:46:32+01:00
status: 1
type: Concept
broader: T96-1124
definition: Jardin consacré à la culture de légumes et de fruits destinés à la consommation personnelle.
in scheme: T96
narrower: T96-1128
preferred label: vegetable gardens & kitchen gardens @en-us