jardin maraîcher
created: 2011-09-01T00:00:00+02:00
modified: 2014-12-31T10:47:19+01:00
status: 1
type: Concept
broad match: Jardin potager
broader: T96-1127
definition: Jardin potager affecté à la culture de végétaux consommables destinés à la vente.
in scheme: T96
preferred label: market gardens @en-us