édicule religieux
created: 2011-09-01T00:00:00+02:00
modified: 2013-04-23T00:00:00+02:00
status: 1
type: Concept
broader: T96-78
definition: Construction autonome non habitable à fonction religieuse.
in scheme: T96
narrower: T96-113
preferred label: religious (other structures) @en-gb
preferred label: religious structures @en-us