jardin en couverture
created: 2011-09-01T00:00:00+02:00
modified: 2014-10-14T11:52:18+02:00
status: 1
type: Concept
broader: T96-1116
definition: Jardin établi sur la couverture d'un édifice, comportant des végétaux d'ornement hors-sol.
in scheme: T96
narrow match: http://data.bnf.fr/ark:/12148/cb150027368
narrow match: http://vocab.getty.edu/aat/300008131
scope note: Le jardin sur dalle est un jardin en couverture où les végétaux sont plantés en pleine terre.