jardin zoologique
terme associe: T96-1162
created: 2011-09-01T00:00:00+02:00
modified: 2014-12-31T11:00:16+01:00
status: 1
type: Concept
alternative label: zoo
broader: T96-1116
definition: Jardin où des animaux rares ou exotiques sont présentés vivant dans des compositions rappelant leur vie en liberté.
in scheme: T96
preferred label: zoos @en-us
related: T96-1162