parc
created: 2011-09-01T00:00:00+02:00
modified: 2014-12-31T11:10:01+01:00
status: 1
type: Concept
broader: T96-1116
definition: Jardin clos de grande superficie, public ou privé, en général d'agrément, présentant un important couvert. On nomme parc ouvert celui dont les limites ne sont pas closes.
in scheme: T96
narrower: T96-1135
narrower: T96-1136
narrower: T96-1137
preferred label: parks @en-us