garenne
created: 2011-09-01T00:00:00+02:00
modified: 2014-10-14T12:02:53+02:00
status: 1
type: Concept
broader: T96-1134
definition: Parc d’utilité constituant une réserve formée d'une étendue boisée entourée de clôtures ou de fossés, destinée à la reproduction et à la chasse des lapins.
in scheme: T96
preferred label: rabbit warrens @en-us