construction de jardin
created: 2011-09-01T00:00:00+02:00
modified: 2014-12-30T16:13:34+01:00
status: 1
type: Concept
broader: T96-1115
definition: Construction de jardin de plus ou moins grande importance destinée à servir d'abri, d'ornement, etc.
in scheme: T96
narrower: T96-1140
narrower: T96-1141
narrower: T96-1158
narrower: T96-1159
narrower: T96-1160
narrower: T96-1161
narrower: T96-1162
narrower: T96-1163
narrower: T96-1164
narrower: T96-1165
narrower: T96-1166
narrower: T96-1167
narrower: T96-1168