édicule religieux chrétien
created: 2011-09-01T00:00:00+02:00
modified: 2015-02-24T11:42:54+01:00
status: 1
type: Concept
broader: T96-112
definition: Construction autonome non habitable liée à la religion chrétienne.
in scheme: T96
narrower: T96-114
narrower: T96-115
narrower: T96-118
narrower: T96-119
narrower: T96-120
narrower: T96-121
narrower: T96-2450
preferred label: christian + religious structures @en-us
scope note: Voir aussi le Thesaurus des objets mobiliers.