fabrique de jardin
terme associe: T96-118
terme associe: T96-192
created: 2011-09-01T00:00:00+02:00
modified: 2014-12-30T15:50:28+01:00
status: 1
type: Concept
alternative label: fabrique
broader: T96-1139
definition: Petite construction aménagée pour le promeneur, intégrée à la composition d'un jardin ou d'un parc et présentant un caractère ornemental. Toutes les formes architecturales peuvent être mises en œuvre : pavillon, rotonde, tholos, etc.
in scheme: T96
narrower: T96-1142
narrower: T96-1143
narrower: T96-1145
narrower: T96-1146
narrower: T96-1147
narrower: T96-1148
narrower: T96-1149
narrower: T96-1150
narrower: T96-1151
narrower: T96-1152
narrower: T96-1153
narrower: T96-1154
narrower: T96-1155
narrower: T96-1157
related: T96-118
related: T96-192
scope note: Ne pas confondre avec folie.