fabrique en belvédère
terme associe: T96-1201
created: 2011-09-01T00:00:00+02:00
modified: 2014-12-30T15:30:20+01:00
status: 1
type: Concept
broader: T96-1141
definition: Fabrique située sur un point élevé, pour ménager des vues sur le jardin ou le paysage environnant.
in scheme: T96
related: T96-1201