ruine artificielle
created: 2011-09-01T00:00:00+02:00
modified: 2014-12-30T15:40:56+01:00
status: 1
type: Concept
alternative label: ruine
broader: T96-1141
definition: Fabrique construite à l'imitation d'une ruine ou ancienne construction délibérément laissée à l'abandon pour constituer une fabrique.
in scheme: T96
preferred label: artificial ruins @en-us
scope note: Ne pas confondre avec un édifice à l'état de ruine ; si cet édifice n'est pas identifiable, sa désignation sera édifice à fonction non identifiée et l’état de l’œuvre sera présenté dans sa description.