théâtre de verdure
created: 2011-09-01T00:00:00+02:00
modified: 2014-12-30T15:46:21+01:00
status: 1
type: Concept
broader: T96-1155
definition: Théâtre de jardin dont la structure est constituée de végétaux de pleine terre.
in scheme: T96