hameau de jardin
created: 2011-09-01T00:00:00+02:00
modified: 2014-10-14T09:51:13+02:00
status: 1
type: Concept
broader: T96-1139
definition: Ferme autour de laquelle sont regroupés divers bâtiments, à l'imitation d'une petite agglomération rurale.
in scheme: T96