muette
created: 2011-09-01T00:00:00+02:00
modified: 2014-12-30T16:03:56+01:00
status: 1
type: Concept
broader: T96-1139
definition: Communs élevés dans un parc de chasse composés des logements destinés au capitaine et aux officiers de la vénerie, accompagnés d'un chenil pour la meute.
in scheme: T96