orangerie
created: 2011-09-01T00:00:00+02:00
modified: 2014-12-30T16:07:48+01:00
status: 1
type: Concept
broader: T96-1139
definition: Bâtiment ou pièce chauffé où l'on remise l'hiver les orangers et autres arbres et plantes en pot pour les protéger du gel.
in scheme: T96
preferred label: orangeries @en-us