pont de jardin
terme associe: T96-1097
created: 2011-09-01T00:00:00+02:00
modified: 2014-12-30T16:10:25+01:00
status: 1
type: Concept
alternative label: pont décoré
broader: T96-1139
definition: Ouvrage de jardin franchissant un espace et portant un chemin ou un aqueduc. Le ponceau ne possède qu'une seule arche. Il est appelé pont décoré lorsqu'il présente un caractère ornemental, monumental ou pittoresque. La passerelle est un pont en charpente, une simple planche ou un tronc d'arbre.
in scheme: T96
related: T96-1097