serre
created: 2011-09-01T00:00:00+02:00
modified: 2014-12-30T16:12:27+01:00
status: 1
type: Concept
broader: T96-1139
definition: Bâtiment, corps de bâtiment ou pièce où l'on réunit les arbrisseaux et les plantes pour les garantir contre le froid ou favoriser leur croissance. La serre est souvent vitrée.
in scheme: T96
preferred label: greenhouses @en-us
scope note: Ne pas nommer serre un châssis de couche, qui est un coffrage vitré.