croix de cimetière
created: 2011-09-01T00:00:00+02:00
modified: 2015-02-24T12:04:04+01:00
status: 1
type: Concept
broader: T96-115
definition: Croix monumentale érigée dans un cimetière.
in scheme: T96
preferred label: churchyard cross @en-gb
preferred label: cemetery + crosses @en-us
preferred label: croce cimiteriale @it
scope note: Une croix de cimetière in situ fait l'objet d'un dossier architecture. Elle ne fait l’objet d’un dossier objets mobiliers que si elle est déposée. Voir aussi le Thesaurus des objets mobiliers.