fausse rivière
created: 2011-09-01T00:00:00+02:00
modified: 2014-10-14T11:11:19+02:00
status: 1
type: Concept
broader: T96-1169
definition: Réservoir affectant la forme d'une rivière dont les extrémités sont dissimulées au moyen d'artifices divers : végétaux, rochers naturels ou artificiels.
in scheme: T96
scope note: Ne pas appeler fausse rivière un bras mort ou secondaire d'un cours d'eau.