île artificielle
created: 2011-09-01T00:00:00+02:00
modified: 2014-12-30T17:06:45+01:00
status: 1
type: Concept
broader: T96-1169
definition: Île aménagée pour l'ornement d'un jardin. L'île champêtre veut s'apparenter à une île naturelle. L'île architecturée est régulière et à rives maçonnées.
in scheme: T96
preferred label: artificial islands @en-us