jeu d'eau
created: 2011-09-01T00:00:00+02:00
modified: 2014-12-30T17:08:50+01:00
status: 1
type: Concept
alternative label: jet d'eau
broader: T96-1169
definition: Arrivée d'eau sous pression jaillissant d'un tuyau, qui décrit une figure et retombe dans une étendue d'eau (bassin, lac, etc.). Le jeu d'eau peut être accompagné d'effets sonores ou lumineux.
in scheme: T96