lac de jardin
created: 2011-09-01T00:00:00+02:00
modified: 2014-12-30T17:09:43+01:00
status: 1
type: Concept
broader: T96-1169
definition: Lac, souvent artificiel, destiné à l'ornementation d'un jardin d'agrément.
in scheme: T96