naumachie
created: 2011-09-01T00:00:00+02:00
modified: 2014-12-30T17:11:10+01:00
status: 1
type: Concept
broader: T96-1169
definition: Bassin aux vastes dimensions, entouré ou non d'une colonnade, où l'on pratique des jeux nautiques à l'imitation des naumachies de la Rome antique.
in scheme: T96