bassin
created: 2011-09-01T00:00:00+02:00
modified: 2014-12-31T10:13:46+01:00
status: 1
type: Concept
broader: T96-1178
definition: Réservoir d'eau formé par une fosse, souvent maçonnée. Il est généralement alimenté par une fontaine.
in scheme: T96
scope note: Bassin et fontaine sont complémentaires : on donne le nom de bassin à l'ensemble composé de ces deux éléments lorsque le réservoir a plus d'importance que le traitement monumental de l'arrivée de l'eau.