grotte de Lourdes
terme associe: T96-1141
created: 2011-09-01T00:00:00+02:00
modified: 2015-02-24T12:06:56+01:00
status: 1
type: Concept
broader: T96-113
definition: Edicule évoquant la grotte miraculeuse de Lourdes, comprenant un rocher artificiel ou aménagé abritant une statue de l'Immaculée Conception dans une niche et au pied duquel on trouve généralement une seconde statue représentant sainte Bernadette en prière.
in scheme: T96
preferred label: Lourdes grottoes @en-us
related: T96-1141
scope note: Voir aussi le Thesaurus des objets mobiliers.