canal de jardin
created: 2011-09-01T00:00:00+02:00
modified: 2014-12-31T10:18:14+01:00
status: 1
type: Concept
broader: T96-1178
definition: Grand bassin étroit et allongé. La tête de canal est la fontaine de ce bassin, adossée à une des extrémités.
in scheme: T96