miroir d'eau
created: 2011-09-01T00:00:00+02:00
modified: 2014-12-31T10:21:54+01:00
status: 1
type: Concept
broader: T96-1178
definition: Bassin sans fontaine : la surface de ses eaux n'est pas troublée par des jets ou des chutes ; elle multiplie souvent par réflexion les effets d'une ordonnance.
in scheme: T96
preferred label: reflecting pools @en-us