parterre d'eau
created: 2011-09-01T00:00:00+02:00
modified: 2014-12-31T10:23:26+01:00
status: 1
type: Concept
broader: T96-1178
definition: Composition formée de plusieurs bassins d'ornement disposés de façon à adopter l'aspect d'un parterre de compartiments. Elle comporte généralement des jeux d'eau.
in scheme: T96