rivière artificielle
created: 2011-09-01T00:00:00+02:00
modified: 2014-12-31T10:24:53+01:00
status: 1
type: Concept
broader: T96-1169
definition: Cours d'eau artificiel, de faible dénivellation et de moyenne largeur, dont le flux se poursuit ou semble se poursuivre hors des limites du jardin.
in scheme: T96