allée
created: 2011-09-01T00:00:00+02:00
modified: 2014-12-30T15:11:02+01:00
status: 1
type: Concept
alternative label: allée de jardin
broader: T96-1185
definition: Voie de communication aménagée à l'intérieur des limites d'un parc ou d'un jardin, dont la largeur est en principe supérieure à deux mètres. Elle peut être régulière ou irrégulière. La contre-allée double une allée plus grande, dont elle n'est séparée que par des rangées d'arbre, une plate-bande, etc.
in scheme: T96
narrower: T96-1187
narrower: T96-1188
narrower: T96-1189
preferred label: allées @en-us
scope note: Ne pas employer en urbanisme. Voir alleé cavalière, boulevard, avenue, etc.