allée couverte de jardin
created: 2011-09-01T00:00:00+02:00
modified: 2014-12-30T15:02:11+01:00
status: 1
type: Concept
broader: T96-1186
definition: Allée formant un passage à couvert. L'allée sous voûte de verdure est constituée par des arbres de haute-tige taillés en marquise. Le berceau de verdure est constitué d'une palissade de verdure dont les branches forment un couvrement en berceau.
in scheme: T96
preferred label: covered walkways @en-us
scope note: Ne pas confondre avec allée couverte.