passe-pied
created: 2011-09-01T00:00:00+02:00
modified: 2014-09-30T10:23:15+02:00
status: 1
type: Concept
broad match: cb13162947m
broad match: http://vocab.getty.edu/aat/300008328
broader: T96-1186
definition: Sentier étroit aménagé à l'intérieur ou autour d'une pièce découverte pour permettre l'entretien des plantations. Il contribue à souligner la composition.
in scheme: T96