avenue de jardin
created: 2011-09-01T00:00:00+02:00
modified: 2014-10-14T09:29:41+02:00
status: 1
type: Concept
broader: T96-1185
definition: Voie privée, carrossable, longue et large, souvent bordée d'arbres, précédant l'entrée d'un jardin. Elle présente en général un tracé rectiligne.
in scheme: T96