chemin de ceinture
created: 2011-09-01T00:00:00+02:00
modified: 2013-04-23T00:00:00+02:00
status: 1
type: Concept
broader: T96-1191
definition: Chemin établi à l'intérieur d'un jardin dont il longe les limites ; il ne comporte aucune vue vers l'extérieur et favorise au contraire les vues vers le jardin.
in scheme: T96