clôture de jardin
terme associe: T96-1323
created: 2011-09-01T00:00:00+02:00
modified: 2014-12-30T15:13:52+01:00
status: 1
type: Concept
broader: T96-1185
definition: Ouvrage divisant ou délimitant un jardin et faisant obstacle au passage.
in scheme: T96
narrower: T96-1194
narrower: T96-1195
narrower: T96-1197
related: T96-1323